Target
Sphingosine 1-phosphate receptor 3
Ligand
BDBM31081
Substrate
Meas. Tech.
S1P3 Dose Response Assay Counterscreen for 5-Hydroxytryptamine(Serotonin) Receptor Subtype 1E Antagonists
IC50
>12390±n/a nM
Citation
 PubChem, PC S1P3 Dose Response Assay Counterscreen for 5-Hydroxytryptamine(Serotonin) Receptor Subtype 1E Antagonists PubChem Bioassay (2007)[AID] 
Target
Name:
Sphingosine 1-phosphate receptor 3
Synonyms:
C9orf108 EDG3 S1P receptor 3 S1P3 S1PR3_HUMAN Sphingosine 1-phosphate receptor 3 (S1P3) | Sphingosine 1-phosphate receptor Edg-3
Type:
G Protein-Coupled Receptor (GPCR)
Mol. Mass.:
42278.13
Organism:
Homo sapiens (Human)
Description:
Q99500
Residue:
378
  
Inhibitor
Name:
BDBM31081
Synonyms:
7-(hydroxymethyl)-2-(4-phenylphenyl)-4,7a-dihydro-3aH-octahydro-1H-4,7-epoxyisoindole-1,3-dione MLS000110473 cid_2899176
Type:
Small organic molecule
Emp. Form.:
C21H17NO4
Mol. Mass.:
347.364
SMILES:
[H]C12OC(CO)(C=C1)c1c(O)n(c(O)c21)-c1ccc(cc1)-c1ccccc1
: