Target
Heat shock 70 kDa protein 1A
Ligand
BDBM31699
Substrate
Meas. Tech.
TR-FRET secondary assay for HTS discovery of chemical inhibitors of Hsp70
IC50
>100000±0 nM
Citation
 PubChem, PC TR-FRET secondary assay for HTS discovery of chemical inhibitors of Hsp70 PubChem Bioassay (2008)[AID] 
Target
Name:
Heat shock 70 kDa protein 1A
Synonyms:
HSPA1A V9GZ37_HUMAN | heat shock 70kDa protein 1A
Type:
ATP-binding protein
Mol. Mass.:
51937.99
Organism:
Homo sapiens (Human)
Description:
gi_123271505; GST-tagged ATPase domain
Residue:
476
  
Inhibitor
Name:
BDBM31699
Synonyms:
(4-methoxy-1,3-benzothiazol-2-yl)-[5-(4-methoxyphenyl)-1,3,4-oxadiazol-2-yl]amine MLS000045458 SMR000027218 | cid_3236395
Type:
Small organic molecule
Emp. Form.:
C17H14N4O3S
Mol. Mass.:
354.383
SMILES:
COc1ccc(cc1)-c1nnc(Nc2nc3c(OC)cccc3s2)o1
: