Target
Complement C1s subcomponent
Ligand
BDBM40793
Substrate
Meas. Tech.
Complement factor C1s IC50 from mixture screen
IC50
>50000±0 nM
Citation
 PubChem, PC Complement factor C1s IC50 from mixture screen PubChem Bioassay (2008)[AID] 
Target
Name:
Complement C1s subcomponent
Synonyms:
C1 esterase C1S_HUMAN Complement C1s subcomponent Complement C1s subcomponent light chain Trypsin | complement component 1, s subcomponent
Type:
Protein
Mol. Mass.:
76657.91
Organism:
Homo sapiens (Human)
Description:
P09871
Residue:
688
  
Inhibitor
Name:
BDBM40793
Synonyms:
MLS000076142 N-(5-chloro-2-morpholin-4-ylphenyl)pyrazine-2-carboxamide N-[5-chloro-2-(4-morpholinyl)phenyl]-2-pyrazinecarboxamide SMR000000810 | cid_647782
Type:
Small organic molecule
Emp. Form.:
C15H15ClN4O2
Mol. Mass.:
318.758
SMILES:
Clc1ccc(N2CCOCC2)c(NC(=O)c2cnccn2)c1
: