Target
Complement C1s subcomponent
Ligand
BDBM40796
Substrate
Meas. Tech.
Complement factor C1s IC50 from mixture screen
IC50
>50000±0 nM
Citation
 PubChem, PC Complement factor C1s IC50 from mixture screen PubChem Bioassay (2008)[AID] 
Target
Name:
Complement C1s subcomponent
Synonyms:
C1 esterase C1S_HUMAN Complement C1s subcomponent Complement C1s subcomponent light chain Trypsin | complement component 1, s subcomponent
Type:
Protein
Mol. Mass.:
76657.91
Organism:
Homo sapiens (Human)
Description:
P09871
Residue:
688
  
Inhibitor
Name:
BDBM40796
Synonyms:
MLS000075075 N-(2-ketochromen-6-yl)nicotinamide N-(2-oxo-1-benzopyran-6-yl)-3-pyridinecarboxamide SMR000014853 | cid_650372
Type:
Small organic molecule
Emp. Form.:
C15H10N2O3
Mol. Mass.:
266.2515
SMILES:
O=C(Nc1ccc2oc(=O)ccc2c1)c1cccnc1
: