Target
Complement C1s subcomponent
Ligand
BDBM40807
Substrate
Meas. Tech.
Complement factor C1s IC50 from mixture screen
IC50
>50000±0 nM
Citation
 PubChem, PC Complement factor C1s IC50 from mixture screen PubChem Bioassay (2008)[AID] 
Target
Name:
Complement C1s subcomponent
Synonyms:
C1 esterase C1S_HUMAN Complement C1s subcomponent Complement C1s subcomponent light chain Trypsin | complement component 1, s subcomponent
Type:
Protein
Mol. Mass.:
76657.91
Organism:
Homo sapiens (Human)
Description:
P09871
Residue:
688
  
Inhibitor
Name:
BDBM40807
Synonyms:
MLS000027885 N-[4-[3-(benzotriazol-1-yl)propanoylamino]-2,5-dimethoxyphenyl]thiophene-2-carboxamide SMR000003916 cid_655444
Type:
Small organic molecule
Emp. Form.:
C22H21N5O4S
Mol. Mass.:
451.498
SMILES:
COc1cc(NC(=O)c2cccs2)c(OC)cc1NC(=O)CCn1nnc2ccccc12
: