Target
Complement C1s subcomponent
Ligand
BDBM40826
Substrate
Meas. Tech.
Complement factor C1s IC50 from mixture screen
IC50
>50000±0 nM
Citation
 PubChem, PC Complement factor C1s IC50 from mixture screen PubChem Bioassay (2008)[AID] 
Target
Name:
Complement C1s subcomponent
Synonyms:
C1 esterase C1S_HUMAN Complement C1s subcomponent Complement C1s subcomponent light chain Trypsin | complement component 1, s subcomponent
Type:
Protein
Mol. Mass.:
76657.91
Organism:
Homo sapiens (Human)
Description:
P09871
Residue:
688
  
Inhibitor
Name:
BDBM40826
Synonyms:
2-(2-furoyl)-N-(3-keto-1,5-dimethyl-2-phenyl-3-pyrazolin-4-yl)-3,4-dihydro-1H-isoquinoline-3-carboxamide N-(1,5-dimethyl-3-oxidanylidene-2-phenyl-pyrazol-4-yl)-2-(furan-2-ylcarbonyl)-3,4-dihydro-1H-isoquinoline-3-carboxamide N-(1,5-dimethyl-3-oxo-2-phenylpyrazol-4-yl)-2-(furan-2-carbonyl)-3,4-dihydro-1H-isoquinoline-3-carboxamide cid_2998366
Type:
Small organic molecule
Emp. Form.:
C26H24N4O4
Mol. Mass.:
456.4932
SMILES:
Cc1c(NC(=O)C2Cc3ccccc3CN2C(=O)c2ccco2)c(=O)n(-c2ccccc2)n1C
: