Target
Complement C1s subcomponent
Ligand
BDBM40843
Substrate
Meas. Tech.
Complement factor C1s IC50 from mixture screen
IC50
>50000±0 nM
Citation
 PubChem, PC Complement factor C1s IC50 from mixture screen PubChem Bioassay (2008)[AID] 
Target
Name:
Complement C1s subcomponent
Synonyms:
C1 esterase C1S_HUMAN Complement C1s subcomponent Complement C1s subcomponent light chain Trypsin | complement component 1, s subcomponent
Type:
Protein
Mol. Mass.:
76657.91
Organism:
Homo sapiens (Human)
Description:
P09871
Residue:
688
  
Inhibitor
Name:
BDBM40843
Synonyms:
2,4,5-trimethyl-N-[(2-methyl-1,3-thiazol-4-yl)methyl]benzenesulfonamide 2,4,5-trimethyl-N-[(2-methylthiazol-4-yl)methyl]benzenesulfonamide SMR000029762 | cid_3238536
Type:
Small organic molecule
Emp. Form.:
C14H18N2O2S2
Mol. Mass.:
310.435
SMILES:
Cc1nc(CNS(=O)(=O)c2cc(C)c(C)cc2C)cs1
: