Target
Complement C1s subcomponent
Ligand
BDBM38968
Substrate
Meas. Tech.
Complement factor C1s IC50 from mixture screen
IC50
>50000±0 nM
Citation
 PubChem, PC Complement factor C1s IC50 from mixture screen PubChem Bioassay (2008)[AID] 
Target
Name:
Complement C1s subcomponent
Synonyms:
C1 esterase C1S_HUMAN Complement C1s subcomponent Complement C1s subcomponent light chain Trypsin | complement component 1, s subcomponent
Type:
Protein
Mol. Mass.:
76657.91
Organism:
Homo sapiens (Human)
Description:
P09871
Residue:
688
  
Inhibitor
Name:
BDBM38968
Synonyms:
MLS000086346 N-[5-(5-chloro-2-thienyl)-1,3,4-oxadiazol-2-yl]-4-(4,4-dimethyloxazolidin-3-yl)sulfonyl-benzamide N-[5-(5-chlorothien-2-yl)-1,3,4-oxadiazol-2-yl]-4-[(4,4-dimethyl-1,3-oxazolidin-3-yl)sulfonyl]benzamide SMR000021848 | cid_2159039
Type:
Small organic molecule
Emp. Form.:
C18H17ClN4O5S2
Mol. Mass.:
468.934
SMILES:
CC1(C)COCN1S(=O)(=O)c1ccc(cc1)C(=O)Nc1nnc(o1)-c1ccc(Cl)s1
: