Target
Complement C1s subcomponent
Ligand
BDBM40853
Substrate
Meas. Tech.
Complement factor C1s IC50 from mixture screen
IC50
>50000±0 nM
Citation
 PubChem, PC Complement factor C1s IC50 from mixture screen PubChem Bioassay (2008)[AID] 
Target
Name:
Complement C1s subcomponent
Synonyms:
C1 esterase C1S_HUMAN Complement C1s subcomponent Complement C1s subcomponent light chain Trypsin | complement component 1, s subcomponent
Type:
Protein
Mol. Mass.:
76657.91
Organism:
Homo sapiens (Human)
Description:
P09871
Residue:
688
  
Inhibitor
Name:
BDBM40853
Synonyms:
2-[4-[2-(1,3-benzodioxol-5-ylamino)-2-keto-ethyl]piperazino]-N-p-phenetyl-acetamide 2-[4-[2-(1,3-benzodioxol-5-ylamino)-2-oxoethyl]-1-piperazinyl]-N-(4-ethoxyphenyl)acetamide MLS000047435 cid_3242564
Type:
Small organic molecule
Emp. Form.:
C23H28N4O5
Mol. Mass.:
440.4922
SMILES:
CCOc1ccc(NC(=O)CN2CCN(CC(=O)Nc3ccc4OCOc4c3)CC2)cc1
: