Target
Complement C1s subcomponent
Ligand
BDBM40856
Substrate
Meas. Tech.
Complement factor C1s IC50 from mixture screen
IC50
>50000±0 nM
Citation
 PubChem, PC Complement factor C1s IC50 from mixture screen PubChem Bioassay (2008)[AID] 
Target
Name:
Complement C1s subcomponent
Synonyms:
C1 esterase C1S_HUMAN Complement C1s subcomponent Complement C1s subcomponent light chain Trypsin | complement component 1, s subcomponent
Type:
Protein
Mol. Mass.:
76657.91
Organism:
Homo sapiens (Human)
Description:
P09871
Residue:
688
  
Inhibitor
Name:
BDBM40856
Synonyms:
1-(diisobutylsulfamoyl)-N-(4-fluorobenzyl)isonipecotamide 1-[bis(2-methylpropyl)sulfamoyl]-N-[(4-fluorophenyl)methyl]-4-piperidinecarboxamide MLS000096268 cid_3244213
Type:
Small organic molecule
Emp. Form.:
C21H34FN3O3S
Mol. Mass.:
427.576
SMILES:
CC(C)CN(CC(C)C)S(=O)(=O)N1CCC(CC1)C(=O)NCc1ccc(F)cc1
: