Target
Complement C1s subcomponent
Ligand
BDBM40860
Substrate
Meas. Tech.
Complement factor C1s IC50 from mixture screen
IC50
>50000±0 nM
Citation
 PubChem, PC Complement factor C1s IC50 from mixture screen PubChem Bioassay (2008)[AID] 
Target
Name:
Complement C1s subcomponent
Synonyms:
C1 esterase C1S_HUMAN Complement C1s subcomponent Complement C1s subcomponent light chain Trypsin | complement component 1, s subcomponent
Type:
Protein
Mol. Mass.:
76657.91
Organism:
Homo sapiens (Human)
Description:
P09871
Residue:
688
  
Inhibitor
Name:
BDBM40860
Synonyms:
5-keto-N-[2-(p-tolyl)ethyl]-1-(3-pyridylmethyl)pyrrolidine-2-carboxamide N-[2-(4-methylphenyl)ethyl]-5-oxidanylidene-1-(pyridin-3-ylmethyl)pyrrolidine-2-carboxamide N-[2-(4-methylphenyl)ethyl]-5-oxo-1-(pyridin-3-ylmethyl)prolinamide SMR000033656 | cid_3245218
Type:
Small organic molecule
Emp. Form.:
C20H23N3O2
Mol. Mass.:
337.4155
SMILES:
Cc1ccc(CCNC(=O)C2CCC(=O)N2Cc2cccnc2)cc1
: