Target
Complement C1s subcomponent
Ligand
BDBM40868
Substrate
Meas. Tech.
Complement factor C1s IC50 from mixture screen
IC50
>50000±0 nM
Citation
 PubChem, PC Complement factor C1s IC50 from mixture screen PubChem Bioassay (2008)[AID] 
Target
Name:
Complement C1s subcomponent
Synonyms:
C1 esterase C1S_HUMAN Complement C1s subcomponent Complement C1s subcomponent light chain Trypsin | complement component 1, s subcomponent
Type:
Protein
Mol. Mass.:
76657.91
Organism:
Homo sapiens (Human)
Description:
P09871
Residue:
688
  
Inhibitor
Name:
BDBM40868
Synonyms:
2-(2-furanyl)-5,6-dimethyl-4-thieno[2,3-d][1,3]oxazinone 2-(2-furyl)-5,6-dimethyl-thieno[2,3-d][1,3]oxazin-4-one 2-(furan-2-yl)-5,6-dimethylthieno[2,3-d][1,3]oxazin-4-one SMR000070030 | cid_786564
Type:
Small organic molecule
Emp. Form.:
C12H9NO3S
Mol. Mass.:
247.27
SMILES:
Cc1sc2nc(oc(=O)c2c1C)-c1ccco1
: