Target
Complement C1s subcomponent
Ligand
BDBM40891
Substrate
Meas. Tech.
Complement factor C1s IC50 from mixture screen
IC50
>50000±0 nM
Citation
 PubChem, PC Complement factor C1s IC50 from mixture screen PubChem Bioassay (2008)[AID] 
Target
Name:
Complement C1s subcomponent
Synonyms:
C1 esterase C1S_HUMAN Complement C1s subcomponent Complement C1s subcomponent light chain Trypsin | complement component 1, s subcomponent
Type:
Protein
Mol. Mass.:
76657.91
Organism:
Homo sapiens (Human)
Description:
P09871
Residue:
688
  
Inhibitor
Name:
BDBM40891
Synonyms:
4-butyl-3-(5-chloranyl-2-methoxy-phenyl)-1H-1,2,4-triazole-5-thione 4-butyl-3-(5-chloro-2-methoxyphenyl)-1H-1,2,4-triazole-5-thione MLS000050054 cid_2210728
Type:
Small organic molecule
Emp. Form.:
C13H16ClN3OS
Mol. Mass.:
297.804
SMILES:
CCCCn1c(n[nH]c1=S)-c1cc(Cl)ccc1OC
: