Target
Complement C1s subcomponent
Ligand
BDBM40906
Substrate
Meas. Tech.
Complement factor C1s IC50 from mixture screen
IC50
>50000±0 nM
Citation
 PubChem, PC Complement factor C1s IC50 from mixture screen PubChem Bioassay (2008)[AID] 
Target
Name:
Complement C1s subcomponent
Synonyms:
C1 esterase C1S_HUMAN Complement C1s subcomponent Complement C1s subcomponent light chain Trypsin | complement component 1, s subcomponent
Type:
Protein
Mol. Mass.:
76657.91
Organism:
Homo sapiens (Human)
Description:
P09871
Residue:
688
  
Inhibitor
Name:
BDBM40906
Synonyms:
MLS000116175 N-[2-[benzyl(methyl)amino]ethyl]-2-(2-oxo-1,3-benzothiazol-3-yl)acetamide N-[2-[methyl-(phenylmethyl)amino]ethyl]-2-(2-oxo-1,3-benzothiazol-3-yl)acetamide cid_5307429
Type:
Small organic molecule
Emp. Form.:
C19H21N3O2S
Mol. Mass.:
355.454
SMILES:
CN(CCNC(=O)Cn1c2ccccc2sc1=O)Cc1ccccc1
: