Target
Complement C1s subcomponent
Ligand
BDBM40919
Substrate
Meas. Tech.
Complement factor C1s IC50 from mixture screen
IC50
>50000±0 nM
Citation
 PubChem, PC Complement factor C1s IC50 from mixture screen PubChem Bioassay (2008)[AID] 
Target
Name:
Complement C1s subcomponent
Synonyms:
C1 esterase C1S_HUMAN Complement C1s subcomponent Complement C1s subcomponent light chain Trypsin | complement component 1, s subcomponent
Type:
Protein
Mol. Mass.:
76657.91
Organism:
Homo sapiens (Human)
Description:
P09871
Residue:
688
  
Inhibitor
Name:
BDBM40919
Synonyms:
2-methyl-5-[[4-(phenylmethyl)-1-piperazinyl]-thiophen-2-ylmethyl]-6-thiazolo[3,2-b][1,2,4]triazolol 5-[(4-benzylpiperazin-1-yl)-thiophen-2-ylmethyl]-2-methyl-[1,3]thiazolo[3,2-b][1,2,4]triazol-6-ol MLS000101815 cid_5081571
Type:
Small organic molecule
Emp. Form.:
C21H23N5OS2
Mol. Mass.:
425.57
SMILES:
Cc1nc2sc(C(N3CCN(Cc4ccccc4)CC3)c3cccs3)c(O)n2n1
: