Target
Complement C1s subcomponent
Ligand
BDBM40926
Substrate
Meas. Tech.
Complement factor C1s IC50 from mixture screen
IC50
>50000±0 nM
Citation
 PubChem, PC Complement factor C1s IC50 from mixture screen PubChem Bioassay (2008)[AID] 
Target
Name:
Complement C1s subcomponent
Synonyms:
C1 esterase C1S_HUMAN Complement C1s subcomponent Complement C1s subcomponent light chain Trypsin | complement component 1, s subcomponent
Type:
Protein
Mol. Mass.:
76657.91
Organism:
Homo sapiens (Human)
Description:
P09871
Residue:
688
  
Inhibitor
Name:
BDBM40926
Synonyms:
(5Z)-5-(1-butyl-2-keto-indolin-3-ylidene)-2-piperidino-2-thiazolin-4-one (5Z)-5-(1-butyl-2-oxo-3-indolylidene)-2-(1-piperidinyl)-4-thiazolone MLS000111979 cid_1905581
Type:
Small organic molecule
Emp. Form.:
C20H23N3O2S
Mol. Mass.:
369.481
SMILES:
CCCCN1C(=O)\C(=C2/SC(=NC2=O)N2CCCCC2)c2ccccc12
: