Target
Complement C1s subcomponent
Ligand
BDBM32798
Substrate
Meas. Tech.
Complement factor C1s IC50 from mixture screen
IC50
25950±1740 nM
Citation
 PubChem, PC Complement factor C1s IC50 from mixture screen PubChem Bioassay (2008)[AID] 
Target
Name:
Complement C1s subcomponent
Synonyms:
C1 esterase C1S_HUMAN Complement C1s subcomponent Complement C1s subcomponent light chain Trypsin | complement component 1, s subcomponent
Type:
Protein
Mol. Mass.:
76657.91
Organism:
Homo sapiens (Human)
Description:
P09871
Residue:
688
  
Inhibitor
Name:
BDBM32798
Synonyms:
(2-acetyl-1-methylindol-3-yl) furan-2-carboxylate 2-furancarboxylic acid (2-acetyl-1-methyl-3-indolyl) ester SMR000109417 furan-2-carboxylic acid (2-acetyl-1-methyl-indol-3-yl) ester
Type:
Small organic molecule
Emp. Form.:
C16H13NO4
Mol. Mass.:
283.2787
SMILES:
CC(=O)c1c(OC(=O)c2ccco2)c2ccccc2n1C
: