Target
Complement C1s subcomponent
Ligand
BDBM40931
Substrate
Meas. Tech.
Complement factor C1s IC50 from mixture screen
IC50
>50000±0 nM
Citation
 PubChem, PC Complement factor C1s IC50 from mixture screen PubChem Bioassay (2008)[AID] 
Target
Name:
Complement C1s subcomponent
Synonyms:
C1 esterase C1S_HUMAN Complement C1s subcomponent Complement C1s subcomponent light chain Trypsin | complement component 1, s subcomponent
Type:
Protein
Mol. Mass.:
76657.91
Organism:
Homo sapiens (Human)
Description:
P09871
Residue:
688
  
Inhibitor
Name:
BDBM40931
Synonyms:
2-pyrazinecarboxylic acid [2-(4-benzoyloxyphenyl)-2-oxoethyl] ester SMR000109296 [2-oxidanylidene-2-[4-(phenylcarbonyloxy)phenyl]ethyl] pyrazine-2-carboxylate pyrazinic acid [2-(4-benzoyloxyphenyl)-2-keto-ethyl] ester
Type:
Small organic molecule
Emp. Form.:
C20H14N2O5
Mol. Mass.:
362.3356
SMILES:
O=C(COC(=O)c1cnccn1)c1ccc(OC(=O)c2ccccc2)cc1
: