Target
Complement C1s subcomponent
Ligand
BDBM32801
Substrate
Meas. Tech.
Complement factor C1s IC50 from mixture screen
IC50
850±60 nM
Citation
 PubChem, PC Complement factor C1s IC50 from mixture screen PubChem Bioassay (2008)[AID] 
Target
Name:
Complement C1s subcomponent
Synonyms:
C1 esterase C1S_HUMAN Complement C1s subcomponent Complement C1s subcomponent light chain Trypsin | complement component 1, s subcomponent
Type:
Protein
Mol. Mass.:
76657.91
Organism:
Homo sapiens (Human)
Description:
P09871
Residue:
688
  
Inhibitor
Name:
BDBM32801
Synonyms:
1,3-benzodioxol-5-yl(1-benzotriazolyl)methanone MLS000108681 cid_737680
Type:
Small organic molecule
Emp. Form.:
C14H9N3O3
Mol. Mass.:
267.2396
SMILES:
O=C(c1ccc2OCOc2c1)n1nnc2ccccc12
: