Target
Focal adhesion kinase 1
Ligand
BDBM40937
Substrate
Meas. Tech.
Dose-response biochemical assay for inhibitors of Focal Adhesion Kinase (FAK)
IC50
>70000±n/a nM
Citation
 PubChem, PC Dose-response biochemical assay for inhibitors of Focal Adhesion Kinase (FAK) PubChem Bioassay (2007)[AID] 
Target
Name:
Focal adhesion kinase 1
Synonyms:
FADK 1 FAK1 FLT4 Focal adhesion kinase (FAK) Focal adhesion kinase 1 (FAK) Focal adhesion kinase-related nonkinase PTK2 Protein-tyrosine kinase 2 p125FAK | pp125FAK
Type:
Tyrosine-protein kinase
Mol. Mass.:
119233.17
Organism:
Homo sapiens (Human)
Description:
Q05397
Residue:
1052
  
Inhibitor
Name:
BDBM40937
Synonyms:
2-Methyl-5-oxo-7-thiophen-2-yl-4-thiophen-3-yl-1,4,5,6,7,8-hexahydro-quinoline-3-carboxylic acid 2-methoxy-ethyl ester 2-methoxyethyl 2-methyl-5-oxo-7-thiophen-2-yl-4-thiophen-3-yl-4,6,7,8-tetrahydro-1H-quinoline-3-carboxylate 5-keto-2-methyl-7-(2-thienyl)-4-(3-thienyl)-4,6,7,8-tetrahydro-1H-quinoline-3-carboxylic acid 2-methoxyethyl ester SMR000012830 | cid_644922
Type:
Small organic molecule
Emp. Form.:
C22H23NO4S2
Mol. Mass.:
429.552
SMILES:
COCCOC(=O)C1C(c2ccsc2)C2=C(CC(CC2=O)c2cccs2)N=C1C
: