Target
Focal adhesion kinase 1
Ligand
BDBM40958
Substrate
Meas. Tech.
Dose-response biochemical assay for inhibitors of Focal Adhesion Kinase (FAK)
IC50
3493±n/a nM
Citation
 PubChem, PC Dose-response biochemical assay for inhibitors of Focal Adhesion Kinase (FAK) PubChem Bioassay (2007)[AID] 
Target
Name:
Focal adhesion kinase 1
Synonyms:
FADK 1 FAK1 FLT4 Focal adhesion kinase (FAK) Focal adhesion kinase 1 (FAK) Focal adhesion kinase-related nonkinase PTK2 Protein-tyrosine kinase 2 p125FAK | pp125FAK
Type:
Tyrosine-protein kinase
Mol. Mass.:
119233.17
Organism:
Homo sapiens (Human)
Description:
Q05397
Residue:
1052
  
Inhibitor
Name:
BDBM40958
Synonyms:
(6E)-6-[2-amino-5-(4-methoxyphenyl)-1H-pyrimidin-6-ylidene]-3-methoxy-1-cyclohexa-2,4-dienone (6E)-6-[2-amino-5-(4-methoxyphenyl)-1H-pyrimidin-6-ylidene]-3-methoxycyclohexa-2,4-dien-1-one MLS000083254 cid_5389961
Type:
Small organic molecule
Emp. Form.:
C18H17N3O3
Mol. Mass.:
323.3459
SMILES:
COc1ccc(cc1)-c1cnc(N)nc1-c1ccc(OC)cc1O
: