Target
Focal adhesion kinase 1
Ligand
BDBM40966
Substrate
Meas. Tech.
Dose-response biochemical assay for inhibitors of Focal Adhesion Kinase (FAK)
IC50
4062±n/a nM
Citation
 PubChem, PC Dose-response biochemical assay for inhibitors of Focal Adhesion Kinase (FAK) PubChem Bioassay (2007)[AID] 
Target
Name:
Focal adhesion kinase 1
Synonyms:
FADK 1 FAK1 FLT4 Focal adhesion kinase (FAK) Focal adhesion kinase 1 (FAK) Focal adhesion kinase-related nonkinase PTK2 Protein-tyrosine kinase 2 p125FAK | pp125FAK
Type:
Tyrosine-protein kinase
Mol. Mass.:
119233.17
Organism:
Homo sapiens (Human)
Description:
Q05397
Residue:
1052
  
Inhibitor
Name:
BDBM40966
Synonyms:
2,2-dichloro-1-[(2,2-dimethylpropanoyl)amino]vinylphosphonic acid SMR000023939 [2,2-dichloro-1-(2,2-dimethylpropanoylamino)ethenyl]phosphonic acid [2,2-dichloro-1-[(2,2-dimethyl-1-oxopropyl)amino]ethenyl]phosphonic acid | cid_3239295
Type:
Small organic molecule
Emp. Form.:
C7H12Cl2NO4P
Mol. Mass.:
276.054
SMILES:
[#6]C([#6])([#6])[#6](=O)-[#7]\[#6](=[#6](/Cl)Cl)P([#8])([#8])=O
: