Target
Focal adhesion kinase 1
Ligand
BDBM40031
Substrate
Meas. Tech.
Dose-response biochemical assay for inhibitors of Focal Adhesion Kinase (FAK)
IC50
1731±n/a nM
Citation
 PubChem, PC Dose-response biochemical assay for inhibitors of Focal Adhesion Kinase (FAK) PubChem Bioassay (2007)[AID] 
Target
Name:
Focal adhesion kinase 1
Synonyms:
FADK 1 FAK1 FLT4 Focal adhesion kinase (FAK) Focal adhesion kinase 1 (FAK) Focal adhesion kinase-related nonkinase PTK2 Protein-tyrosine kinase 2 p125FAK | pp125FAK
Type:
Tyrosine-protein kinase
Mol. Mass.:
119233.17
Organism:
Homo sapiens (Human)
Description:
Q05397
Residue:
1052
  
Inhibitor
Name:
BDBM40031
Synonyms:
MLS000095690 N-[4-[5-(2-furyl)triazol-1-yl]phenyl]-2-keto-chromene-3-carboxamide N-[4-[5-(furan-2-yl)triazol-1-yl]phenyl]-2-oxochromene-3-carboxamide SMR000031236 | cid_3241109
Type:
Small organic molecule
Emp. Form.:
C22H14N4O4
Mol. Mass.:
398.371
SMILES:
O=C(Nc1ccc(cc1)-n1nncc1-c1ccco1)c1cc2ccccc2oc1=O
: