Target
Focal adhesion kinase 1
Ligand
BDBM40988
Substrate
Meas. Tech.
Dose-response biochemical assay for inhibitors of Focal Adhesion Kinase (FAK)
IC50
>70000±n/a nM
Citation
 PubChem, PC Dose-response biochemical assay for inhibitors of Focal Adhesion Kinase (FAK) PubChem Bioassay (2007)[AID] 
Target
Name:
Focal adhesion kinase 1
Synonyms:
FADK 1 FAK1 FLT4 Focal adhesion kinase (FAK) Focal adhesion kinase 1 (FAK) Focal adhesion kinase-related nonkinase PTK2 Protein-tyrosine kinase 2 p125FAK | pp125FAK
Type:
Tyrosine-protein kinase
Mol. Mass.:
119233.17
Organism:
Homo sapiens (Human)
Description:
Q05397
Residue:
1052
  
Inhibitor
Name:
BDBM40988
Synonyms:
2-ethoxyethyl 2-methyl-5-oxidanylidene-7-thiophen-2-yl-4-thiophen-3-yl-4,6,7,8-tetrahydro-1H-quinoline-3-carboxylate 2-methyl-5-oxo-7-thiophen-2-yl-4-(3-thiophenyl)-4,6,7,8-tetrahydro-1H-quinoline-3-carboxylic acid 2-ethoxyethyl ester MLS000112765 cid_2917230
Type:
Small organic molecule
Emp. Form.:
C23H25NO4S2
Mol. Mass.:
443.579
SMILES:
CCOCCOC(=O)C1C(c2ccsc2)C2=C(CC(CC2=O)c2cccs2)N=C1C
: