Target
Cathepsin B
Ligand
BDBM41122
Substrate
Meas. Tech.
Cathepsin B dose-response confirmation
IC50
>50000±0 nM
Citation
 PubChem, PC Cathepsin B dose-response confirmation PubChem Bioassay (2008)[AID] 
Target
Name:
Cathepsin B
Synonyms:
APP secretase CATB_HUMAN CTSB Cathepsin B light chain | Cathepsin B1
Type:
Enzyme
Mol. Mass.:
37819.69
Organism:
Homo sapiens (Human)
Description:
gi_63102437
Residue:
339
  
Inhibitor
Name:
BDBM41122
Synonyms:
MLS000120162 N-[(4-fluorophenyl)methyl]-5-oxidanylidene-1-(2-phenylethyl)pyrrolidine-2-carboxamide N-[(4-fluorophenyl)methyl]-5-oxo-1-(2-phenylethyl)pyrrolidine-2-carboxamide cid_3422818
Type:
Small organic molecule
Emp. Form.:
C20H21FN2O2
Mol. Mass.:
340.3913
SMILES:
Fc1ccc(CNC(=O)C2CCC(=O)N2CCc2ccccc2)cc1
: