Target
Procathepsin L
Ligand
BDBM41160
Substrate
Meas. Tech.
Cathepsin L dose-response confirmation
IC50
>50000±0 nM
Citation
 PubChem, PC Cathepsin L dose-response confirmation PubChem Bioassay (2008)[AID] 
Target
Name:
Procathepsin L
Synonyms:
CATL1_HUMAN CTSL CTSL1 Cathepsin L Cathepsin L1 heavy chain MEP cathepsin L preproprotein
Type:
Enzyme
Mol. Mass.:
37557.19
Organism:
Homo sapiens (Human)
Description:
Purchased from Calbiochem (San Diego, CA).
Residue:
333
  
Inhibitor
Name:
BDBM41160
Synonyms:
2-(1H-Benzoimidazol-2-ylsulfanyl)-N-(2-piperidin-1-yl-ethyl)-acetamide 2-(1H-benzimidazol-2-ylsulfanyl)-N-(2-piperidin-1-ylethyl)ethanamide 2-(1H-benzimidazol-2-ylthio)-N-[2-(1-piperidinyl)ethyl]acetamide SMR000020043 | cid_752452
Type:
Small organic molecule
Emp. Form.:
C16H22N4OS
Mol. Mass.:
318.437
SMILES:
O=C(CSc1nc2ccccc2[nH]1)NCCN1CCCCC1
: