Target
Procathepsin L
Ligand
BDBM41184
Substrate
Meas. Tech.
Cathepsin L dose-response confirmation
IC50
4909.56±3239.42 nM
Citation
 PubChem, PC Cathepsin L dose-response confirmation PubChem Bioassay (2008)[AID] 
Target
Name:
Procathepsin L
Synonyms:
CATL1_HUMAN CTSL CTSL1 Cathepsin L Cathepsin L1 heavy chain MEP cathepsin L preproprotein
Type:
Enzyme
Mol. Mass.:
37557.19
Organism:
Homo sapiens (Human)
Description:
Purchased from Calbiochem (San Diego, CA).
Residue:
333
  
Inhibitor
Name:
BDBM41184
Synonyms:
2-[[3-(4-fluorophenyl)-[1,2,4]triazolo[4,3-b]pyridazin-6-yl]sulfanyl]propanoic acid 2-[[3-(4-fluorophenyl)-[1,2,4]triazolo[4,3-b]pyridazin-6-yl]thio]propionic acid SMR000016796 | cid_5309980
Type:
Small organic molecule
Emp. Form.:
C14H11FN4O2S
Mol. Mass.:
318.326
SMILES:
CC(Sc1ccc2nnc(-c3ccc(F)cc3)n2n1)C(O)=O
: