Target
Procathepsin L
Ligand
BDBM41187
Substrate
Meas. Tech.
Cathepsin L dose-response confirmation
IC50
>50000±0 nM
Citation
 PubChem, PC Cathepsin L dose-response confirmation PubChem Bioassay (2008)[AID] 
Target
Name:
Procathepsin L
Synonyms:
CATL1_HUMAN CTSL CTSL1 Cathepsin L Cathepsin L1 heavy chain MEP cathepsin L preproprotein
Type:
Enzyme
Mol. Mass.:
37557.19
Organism:
Homo sapiens (Human)
Description:
Purchased from Calbiochem (San Diego, CA).
Residue:
333
  
Inhibitor
Name:
BDBM41187
Synonyms:
3-(3-ketobutyl)-4,8-dimethyl-carbostyril 4,8-dimethyl-3-(3-oxobutyl)-1H-quinolin-2-one SMR000103876 | cid_790340
Type:
Small organic molecule
Emp. Form.:
C15H17NO2
Mol. Mass.:
243.301
SMILES:
CC(=O)CCc1c(C)c2cccc(C)c2[nH]c1=O
: