Target
Procathepsin L
Ligand
BDBM41190
Substrate
Meas. Tech.
Cathepsin L dose-response confirmation
IC50
>50000±0 nM
Citation
 PubChem, PC Cathepsin L dose-response confirmation PubChem Bioassay (2008)[AID] 
Target
Name:
Procathepsin L
Synonyms:
CATL1_HUMAN CTSL CTSL1 Cathepsin L Cathepsin L1 heavy chain MEP cathepsin L preproprotein
Type:
Enzyme
Mol. Mass.:
37557.19
Organism:
Homo sapiens (Human)
Description:
Purchased from Calbiochem (San Diego, CA).
Residue:
333
  
Inhibitor
Name:
BDBM41190
Synonyms:
4-chloranyl-N-(5-phenyl-1,3,4-thiadiazol-2-yl)benzenesulfonamide MLS000104552 cid_1013432
Type:
Small organic molecule
Emp. Form.:
C14H10ClN3O2S2
Mol. Mass.:
351.831
SMILES:
Clc1ccc(cc1)S(=O)(=O)Nc1nnc(s1)-c1ccccc1
: