Target
DNA-directed RNA polymerase subunit beta
Ligand
BDBM41198
Substrate
Meas. Tech.
RNA polymerase dose-response confirmation
IC50
>50000±0 nM
Citation
 PubChem, PC RNA polymerase dose-response confirmation PubChem Bioassay (2008)[AID] 
Target
Name:
DNA-directed RNA polymerase subunit beta
Synonyms:
RNA polymerase beta subunit (EC 2.7.7.6)
Type:
Enzyme Catalytic Domain
Mol. Mass.:
150595.80
Organism:
Escherichia coli
Description:
A0A0E2LB94
Residue:
1342
  
Inhibitor
Name:
BDBM41198
Synonyms:
2-[[5-[(4-fluoroanilino)methyl]-4-(4-methylphenyl)-1,2,4-triazol-3-yl]sulfanyl]-1-pyrrolidin-1-ylethanone 2-[[5-[(4-fluoroanilino)methyl]-4-(p-tolyl)-1,2,4-triazol-3-yl]thio]-1-pyrrolidino-ethanone 2-{5-[(4-Fluoro-phenylamino)-methyl]-4-p-tolyl-4H-[1,2,4]triazol-3-ylsulfanyl}-1-pyrrolidin-1-yl-ethanone SMR000001718 | cid_650597
Type:
Small organic molecule
Emp. Form.:
C22H24FN5OS
Mol. Mass.:
425.522
SMILES:
Cc1ccc(cc1)-n1c(CNc2ccc(F)cc2)nnc1SCC(=O)N1CCCC1
: