Target
DNA-directed RNA polymerase subunit beta
Ligand
BDBM32058
Substrate
Meas. Tech.
RNA polymerase dose-response confirmation
IC50
>50000±0 nM
Citation
 PubChem, PC RNA polymerase dose-response confirmation PubChem Bioassay (2008)[AID] 
Target
Name:
DNA-directed RNA polymerase subunit beta
Synonyms:
RNA polymerase beta subunit (EC 2.7.7.6)
Type:
Enzyme Catalytic Domain
Mol. Mass.:
150595.80
Organism:
Escherichia coli
Description:
A0A0E2LB94
Residue:
1342
  
Inhibitor
Name:
BDBM32058
Synonyms:
(3aR,6aS)-3-(3,4-dimethoxyphenyl)-5-(2,6-dimethylphenyl)-3a,6a-dihydropyrrol[3,4-d]isoxazole-4,6-quinone (3aR,6aS)-3-(3,4-dimethoxyphenyl)-5-(2,6-dimethylphenyl)-3a,6a-dihydropyrrolo[3,4-d]isoxazole-4,6-dione SMR000048612 | cid_667333
Type:
Small organic molecule
Emp. Form.:
C21H20N2O5
Mol. Mass.:
380.3939
SMILES:
COc1ccc(cc1OC)-c1[nH]oc2c(O)n(-c3c(C)cccc3C)c(=O)c12
: