Target
DNA-directed RNA polymerase subunit beta
Ligand
BDBM38381
Substrate
Meas. Tech.
RNA polymerase dose-response confirmation
IC50
>50000±0 nM
Citation
 PubChem, PC RNA polymerase dose-response confirmation PubChem Bioassay (2008)[AID] 
Target
Name:
DNA-directed RNA polymerase subunit beta
Synonyms:
RNA polymerase beta subunit (EC 2.7.7.6)
Type:
Enzyme Catalytic Domain
Mol. Mass.:
150595.80
Organism:
Escherichia coli
Description:
A0A0E2LB94
Residue:
1342
  
Inhibitor
Name:
BDBM38381
Synonyms:
1-(5,5-diketo-9-methoxy-benzo[c][1,2]benzothiazin-6-yl)ethanone 1-(9-methoxy-5,5-dioxobenzo[c][1,2]benzothiazin-6-yl)ethanone MLS000048564 cid_2314340
Type:
Small organic molecule
Emp. Form.:
C15H13NO4S
Mol. Mass.:
303.333
SMILES:
COc1ccc2N(C(C)=O)S(=O)(=O)c3ccccc3-c2c1
: