Target
DNA-directed RNA polymerase subunit beta
Ligand
BDBM32099
Substrate
Meas. Tech.
RNA polymerase dose-response confirmation
IC50
35825±625.798 nM
Citation
 PubChem, PC RNA polymerase dose-response confirmation PubChem Bioassay (2008)[AID] 
Target
Name:
DNA-directed RNA polymerase subunit beta
Synonyms:
RNA polymerase beta subunit (EC 2.7.7.6)
Type:
Enzyme Catalytic Domain
Mol. Mass.:
150595.80
Organism:
Escherichia coli
Description:
A0A0E2LB94
Residue:
1342
  
Inhibitor
Name:
BDBM32099
Synonyms:
MLS000044274 N-[5-chloro-2-(trifluoromethyl)-1,3-benzodioxol-2-yl]-1,4-dioxa-8-azaspiro[4.5]decane-8-carboxamide cid_3243924
Type:
Small organic molecule
Emp. Form.:
C16H16ClF3N2O5
Mol. Mass.:
408.757
SMILES:
FC(F)(F)C1(NC(=O)N2CCC3(CC2)OCCO3)Oc2ccc(Cl)cc2O1
: