Target
DNA-directed RNA polymerase subunit beta
Ligand
BDBM41268
Substrate
Meas. Tech.
RNA polymerase dose-response confirmation
IC50
>50000±0 nM
Citation
 PubChem, PC RNA polymerase dose-response confirmation PubChem Bioassay (2008)[AID] 
Target
Name:
DNA-directed RNA polymerase subunit beta
Synonyms:
RNA polymerase beta subunit (EC 2.7.7.6)
Type:
Enzyme Catalytic Domain
Mol. Mass.:
150595.80
Organism:
Escherichia coli
Description:
A0A0E2LB94
Residue:
1342
  
Inhibitor
Name:
BDBM41268
Synonyms:
7-(2-ethoxyethyl)-8-[(4-ethyl-1-piperazinyl)methyl]-1,3-dimethylpurine-2,6-dione 7-(2-ethoxyethyl)-8-[(4-ethylpiperazin-1-yl)methyl]-1,3-dimethylpurine-2,6-dione MLS000101904 cid_3491242
Type:
Small organic molecule
Emp. Form.:
C18H30N6O3
Mol. Mass.:
378.4692
SMILES:
CCOCCn1c(CN2CCN(CC)CC2)nc2n(C)c(=O)n(C)c(=O)c12
: