Target
Complement C1s subcomponent
Ligand
BDBM32669
Substrate
Meas. Tech.
Complement C1s ELISA
IC50
>50000±n/a nM
Citation
 PubChem, PC Complement C1s ELISA PubChem Bioassay (2008)[AID] 
Target
Name:
Complement C1s subcomponent
Synonyms:
C1 esterase C1S_HUMAN Complement C1s subcomponent Complement C1s subcomponent light chain Trypsin | complement component 1, s subcomponent
Type:
Protein
Mol. Mass.:
76657.91
Organism:
Homo sapiens (Human)
Description:
P09871
Residue:
688
  
Inhibitor
Name:
BDBM32669
Synonyms:
(3,4-dimethoxyphenyl)-[3-(2-furanyl)-5-(methylthio)-1,2,4-triazol-1-yl]methanone (3,4-dimethoxyphenyl)-[3-(furan-2-yl)-5-methylsulfanyl-1,2,4-triazol-1-yl]methanone MLS000049344 cid_976363
Type:
Small organic molecule
Emp. Form.:
C16H15N3O4S
Mol. Mass.:
345.373
SMILES:
COc1ccc(cc1OC)C(=O)n1nc(nc1SC)-c1ccco1
: