Target
Complement C1s subcomponent
Ligand
BDBM32672
Substrate
Meas. Tech.
Complement C1s ELISA
IC50
>50000±n/a nM
Citation
 PubChem, PC Complement C1s ELISA PubChem Bioassay (2008)[AID] 
Target
Name:
Complement C1s subcomponent
Synonyms:
C1 esterase C1S_HUMAN Complement C1s subcomponent Complement C1s subcomponent light chain Trypsin | complement component 1, s subcomponent
Type:
Protein
Mol. Mass.:
76657.91
Organism:
Homo sapiens (Human)
Description:
P09871
Residue:
688
  
Inhibitor
Name:
BDBM32672
Synonyms:
MLS000097371 N-[4-(benzotriazol-1-ylcarbonyl)phenyl]butanamide N-[4-(benzotriazole-1-carbonyl)phenyl]butyramide SMR000076008 | cid_2201551
Type:
Small organic molecule
Emp. Form.:
C17H16N4O2
Mol. Mass.:
308.3345
SMILES:
CCCC(=O)Nc1ccc(cc1)C(=O)n1nnc2ccccc12
: