Target
Complement C1s subcomponent
Ligand
BDBM32797
Substrate
Meas. Tech.
Complement C1s ELISA
IC50
>50000±n/a nM
Citation
 PubChem, PC Complement C1s ELISA PubChem Bioassay (2008)[AID] 
Target
Name:
Complement C1s subcomponent
Synonyms:
C1 esterase C1S_HUMAN Complement C1s subcomponent Complement C1s subcomponent light chain Trypsin | complement component 1, s subcomponent
Type:
Protein
Mol. Mass.:
76657.91
Organism:
Homo sapiens (Human)
Description:
P09871
Residue:
688
  
Inhibitor
Name:
BDBM32797
Synonyms:
2-furanyl-[3-(2-furanyl)-5-(methylthio)-1,2,4-triazol-1-yl]methanone MLS000115327 cid_977002 | furan-2-yl-[3-(furan-2-yl)-5-methylsulfanyl-1,2,4-triazol-1-yl]methanone
Type:
Small organic molecule
Emp. Form.:
C12H9N3O3S
Mol. Mass.:
275.283
SMILES:
CSc1nc(nn1C(=O)c1ccco1)-c1ccco1
: