Target
Cathepsin S
Ligand
BDBM41279
Substrate
Meas. Tech.
Cathepsin S dose-response confirmation
IC50
>50000±0 nM
Citation
 PubChem, PC Cathepsin S dose-response confirmation PubChem Bioassay (2008)[AID] 
Target
Name:
Cathepsin S
Synonyms:
CATS_HUMAN Cathepsin S (Cat S) | cathepsin S preproprotein
Type:
Protein
Mol. Mass.:
37507.38
Organism:
Homo sapiens (Human)
Description:
P25774
Residue:
331
  
Inhibitor
Name:
BDBM41279
Synonyms:
MLS000071894 SMR000004295 | cid_644450
Type:
Small organic molecule
Emp. Form.:
C19H19N5O2S2
Mol. Mass.:
413.516
SMILES:
Cc1nc2sc3CCCCc3c2c2nnc(SCC(=O)NCc3ccco3)n12
: