Target
Cathepsin S
Ligand
BDBM41285
Substrate
Meas. Tech.
Cathepsin S dose-response confirmation
IC50
>50000±0 nM
Citation
 PubChem, PC Cathepsin S dose-response confirmation PubChem Bioassay (2008)[AID] 
Target
Name:
Cathepsin S
Synonyms:
CATS_HUMAN Cathepsin S (Cat S) | cathepsin S preproprotein
Type:
Protein
Mol. Mass.:
37507.38
Organism:
Homo sapiens (Human)
Description:
P25774
Residue:
331
  
Inhibitor
Name:
BDBM41285
Synonyms:
1-[3-[3-(3-methoxyphenyl)-1,2,4-oxadiazol-5-yl]-1-piperidinyl]-2-phenylethanone 1-[3-[3-(3-methoxyphenyl)-1,2,4-oxadiazol-5-yl]piperidin-1-yl]-2-phenylethanone 1-{3-[3-(3-Methoxy-phenyl)-[1,2,4]oxadiazol-5-yl]-piperidin-1-yl}-2-phenyl-ethanone SMR000007461 | cid_649916
Type:
Small organic molecule
Emp. Form.:
C22H23N3O3
Mol. Mass.:
377.4363
SMILES:
COc1cccc(c1)-c1noc(n1)C1CCCN(C1)C(=O)Cc1ccccc1
: