Target
Cathepsin S
Ligand
BDBM41314
Substrate
Meas. Tech.
Cathepsin S dose-response confirmation
IC50
>50000±0 nM
Citation
 PubChem, PC Cathepsin S dose-response confirmation PubChem Bioassay (2008)[AID] 
Target
Name:
Cathepsin S
Synonyms:
CATS_HUMAN Cathepsin S (Cat S) | cathepsin S preproprotein
Type:
Protein
Mol. Mass.:
37507.38
Organism:
Homo sapiens (Human)
Description:
P25774
Residue:
331
  
Inhibitor
Name:
BDBM41314
Synonyms:
(2-fluorophenyl)methyl 2,3-dihydro-1,4-benzodioxine-6-carboxylate 2,3-dihydro-1,4-benzodioxin-6-carboxylic acid (2-fluorophenyl)methyl ester SMR000062809 | cid_2432116
Type:
Small organic molecule
Emp. Form.:
C16H13FO4
Mol. Mass.:
288.2704
SMILES:
Fc1ccccc1COC(=O)c1ccc2OCCOc2c1
: