Target
Cathepsin S
Ligand
BDBM50303409
Substrate
Meas. Tech.
Cathepsin S dose-response confirmation
IC50
5839.35±217.914 nM
Citation
 PubChem, PC Cathepsin S dose-response confirmation PubChem Bioassay (2008)[AID] 
Target
Name:
Cathepsin S
Synonyms:
CATS_HUMAN Cathepsin S (Cat S) | cathepsin S preproprotein
Type:
Protein
Mol. Mass.:
37507.38
Organism:
Homo sapiens (Human)
Description:
P25774
Residue:
331
  
Inhibitor
Name:
BDBM50303409
Synonyms:
4-amino-6-(diphenylamino)-1,3,5-triazine-2-carbonitrile cid_712283
Type:
Small organic molecule
Emp. Form.:
C16H12N6
Mol. Mass.:
288.3067
SMILES:
Nc1nc(nc(n1)N(c1ccccc1)c1ccccc1)C#N
: