Target
Cathepsin S
Ligand
BDBM41348
Substrate
Meas. Tech.
Cathepsin S dose-response confirmation
IC50
>50000±0 nM
Citation
 PubChem, PC Cathepsin S dose-response confirmation PubChem Bioassay (2008)[AID] 
Target
Name:
Cathepsin S
Synonyms:
CATS_HUMAN Cathepsin S (Cat S) | cathepsin S preproprotein
Type:
Protein
Mol. Mass.:
37507.38
Organism:
Homo sapiens (Human)
Description:
P25774
Residue:
331
  
Inhibitor
Name:
BDBM41348
Synonyms:
4-[[1-(4-chlorophenyl)-4-pyrazolo[3,4-d]pyrimidinyl]amino]-1-piperidinecarboxylic acid ethyl ester MLS000088837 cid_1314791 ethyl 4-{[1-(4-chlorophenyl)-1H-pyrazolo[3,4-d]pyrimidin-4-yl]amino}-1-piperidinecarboxylate
Type:
Small organic molecule
Emp. Form.:
C19H21ClN6O2
Mol. Mass.:
400.862
SMILES:
CCOC(=O)N1CCC(CC1)Nc1ncnc2n(ncc12)-c1ccc(Cl)cc1
: