Target
Cathepsin S
Ligand
BDBM41355
Substrate
Meas. Tech.
Cathepsin S dose-response confirmation
IC50
>50000±0 nM
Citation
 PubChem, PC Cathepsin S dose-response confirmation PubChem Bioassay (2008)[AID] 
Target
Name:
Cathepsin S
Synonyms:
CATS_HUMAN Cathepsin S (Cat S) | cathepsin S preproprotein
Type:
Protein
Mol. Mass.:
37507.38
Organism:
Homo sapiens (Human)
Description:
P25774
Residue:
331
  
Inhibitor
Name:
BDBM41355
Synonyms:
MLS000120601 cid_4476802
Type:
Small organic molecule
Emp. Form.:
C15H11NO5S2
Mol. Mass.:
349.382
SMILES:
OC(=O)CC12CSc3[nH]c(=O)sc3C1c1ccccc1OC2=O
: