Target
Cathepsin G
Ligand
BDBM32755
Substrate
Meas. Tech.
Cathepsin G dose-response confirmation
IC50
8074.85±1259.35 nM
Citation
 PubChem, PC Cathepsin G dose-response confirmation PubChem Bioassay (2008)[AID] 
Target
Name:
Cathepsin G
Synonyms:
CATG_HUMAN CTSG
Type:
PROTEIN
Mol. Mass.:
28860.08
Organism:
Homo sapiens (Human)
Description:
ChEMBL_1469016
Residue:
255
  
Inhibitor
Name:
BDBM32755
Synonyms:
2-thiophenecarboxylic acid [5-amino-1-(4-methylphenyl)sulfonyl-3-pyrazolyl] ester MLS000033863 Thiophene-2-carboxylic acid 5-amino-1-(toluene-4-sulfonyl)-1H-pyrazol-3-yl ester [5-azanyl-1-(4-methylphenyl)sulfonyl-pyrazol-3-yl] thiophene-2-carboxylate thiophene-2-carboxylic acid (5-amino-1-tosyl-pyrazol-3-yl) ester
Type:
Small organic molecule
Emp. Form.:
C15H13N3O4S2
Mol. Mass.:
363.411
SMILES:
Cc1ccc(cc1)S(=O)(=O)n1nc(OC(=O)c2cccs2)cc1N
: