Target
Cathepsin G
Ligand
BDBM33431
Substrate
Meas. Tech.
Cathepsin G dose-response confirmation
IC50
32162.6±739.385 nM
Citation
 PubChem, PC Cathepsin G dose-response confirmation PubChem Bioassay (2008)[AID] 
Target
Name:
Cathepsin G
Synonyms:
CATG_HUMAN CTSG
Type:
PROTEIN
Mol. Mass.:
28860.08
Organism:
Homo sapiens (Human)
Description:
ChEMBL_1469016
Residue:
255
  
Inhibitor
Name:
BDBM33431
Synonyms:
3-(4-chlorophenyl)-1-(3,4-dimethoxybenzoyl)-1H-1,2,4-triazol-5-amine SMR000074176 [5-azanyl-3-(4-chlorophenyl)-1,2,4-triazol-1-yl]-(3,4-dimethoxyphenyl)methanone | cid_1084415
Type:
Small organic molecule
Emp. Form.:
C17H15ClN4O3
Mol. Mass.:
358.779
SMILES:
COc1ccc(cc1OC)C(=O)n1nc(nc1N)-c1ccc(Cl)cc1
: