Target
Cathepsin G
Ligand
BDBM33628
Substrate
Meas. Tech.
Cathepsin G dose-response confirmation
IC50
2772.6±236.827 nM
Citation
 PubChem, PC Cathepsin G dose-response confirmation PubChem Bioassay (2008)[AID] 
Target
Name:
Cathepsin G
Synonyms:
CATG_HUMAN CTSG
Type:
PROTEIN
Mol. Mass.:
28860.08
Organism:
Homo sapiens (Human)
Description:
ChEMBL_1469016
Residue:
255
  
Inhibitor
Name:
BDBM33628
Synonyms:
2-(3-pyridinyl)-3,1-benzoxazin-4-one 2-pyridin-3-yl-3,1-benzoxazin-4-one SMR000105584 | cid_722912
Type:
Small organic molecule
Emp. Form.:
C13H8N2O2
Mol. Mass.:
224.2148
SMILES:
O=c1oc(nc2ccccc12)-c1cccnc1
: