Target
Ephrin type-B receptor 4
Ligand
BDBM41423
Substrate
Meas. Tech.
Dose-response biochemical assay for antagonists of the interaction between the Eph receptor B4 (EphB4) and its ligand ephrin-B2 via TNYL-RAW peptide
IC50
>79400±n/a nM
Citation
 PubChem, PC Dose-response biochemical assay for antagonists of the interaction between the Eph receptor B4 (EphB4) and its ligand ephrin-B2 via TNYL-RAW peptide PubChem Bioassay (2007)[AID] 
Target
Name:
Ephrin type-B receptor 4
Synonyms:
EPHB4 Ephrin receptor HTK MYK1 Tyrosine-protein kinase TYRO11 | VHL/Ephrin type-B receptor 4
Type:
Enzyme
Mol. Mass.:
108273.51
Organism:
Homo sapiens (Human)
Description:
P54760
Residue:
987
  
Inhibitor
Name:
BDBM41423
Synonyms:
MLS000067975 N-(1,3-benzodioxol-5-yl)-2-[(1-benzyltetrazol-5-yl)thio]acetamide N-(1,3-benzodioxol-5-yl)-2-[[1-(phenylmethyl)-5-tetrazolyl]thio]acetamide SMR000000904 | cid_644654
Type:
Small organic molecule
Emp. Form.:
C17H15N5O3S
Mol. Mass.:
369.398
SMILES:
O=C(CSc1nnnn1Cc1ccccc1)Nc1ccc2OCOc2c1
: