Target
Ephrin type-B receptor 4
Ligand
BDBM41431
Substrate
Meas. Tech.
Dose-response biochemical assay for antagonists of the interaction between the Eph receptor B4 (EphB4) and its ligand ephrin-B2 via TNYL-RAW peptide
IC50
>79400±n/a nM
Citation
 PubChem, PC Dose-response biochemical assay for antagonists of the interaction between the Eph receptor B4 (EphB4) and its ligand ephrin-B2 via TNYL-RAW peptide PubChem Bioassay (2007)[AID] 
Target
Name:
Ephrin type-B receptor 4
Synonyms:
EPHB4 Ephrin receptor HTK MYK1 Tyrosine-protein kinase TYRO11 | VHL/Ephrin type-B receptor 4
Type:
Enzyme
Mol. Mass.:
108273.51
Organism:
Homo sapiens (Human)
Description:
P54760
Residue:
987
  
Inhibitor
Name:
BDBM41431
Synonyms:
1,3-Dimethyl-7-(4-methyl-benzyl)-8-(2-piperidin-1-yl-ethylsulfanyl)-3,7-dihydro-purine-2,6-dione 1,3-dimethyl-7-[(4-methylphenyl)methyl]-8-(2-piperidin-1-ylethylsulfanyl)purine-2,6-dione MLS000035864 cid_649461
Type:
Small organic molecule
Emp. Form.:
C22H29N5O2S
Mol. Mass.:
427.563
SMILES:
Cc1ccc(Cn2c(SCCN3CCCCC3)nc3n(C)c(=O)n(C)c(=O)c23)cc1
: