Target
Ephrin type-B receptor 4
Ligand
BDBM41435
Substrate
Meas. Tech.
Dose-response biochemical assay for antagonists of the interaction between the Eph receptor B4 (EphB4) and its ligand ephrin-B2 via TNYL-RAW peptide
IC50
>79400±n/a nM
Citation
 PubChem, PC Dose-response biochemical assay for antagonists of the interaction between the Eph receptor B4 (EphB4) and its ligand ephrin-B2 via TNYL-RAW peptide PubChem Bioassay (2007)[AID] 
Target
Name:
Ephrin type-B receptor 4
Synonyms:
EPHB4 Ephrin receptor HTK MYK1 Tyrosine-protein kinase TYRO11 | VHL/Ephrin type-B receptor 4
Type:
Enzyme
Mol. Mass.:
108273.51
Organism:
Homo sapiens (Human)
Description:
P54760
Residue:
987
  
Inhibitor
Name:
BDBM41435
Synonyms:
2-(dimethylamino)-6,7-dihydro-[1,3]oxazolo[3,2-a][1,3,5]triazin-4-one 2-Dimethylamino-6,7-dihydro-oxazolo[3,2-a][1,3,5]triazin-4-one SMR000011497 | cid_602681
Type:
Small organic molecule
Emp. Form.:
C7H10N4O2
Mol. Mass.:
182.1799
SMILES:
CN(C)c1nc2OCCn2c(=O)n1
: