Target
Ephrin type-B receptor 4
Ligand
BDBM32068
Substrate
Meas. Tech.
Dose-response biochemical assay for antagonists of the interaction between the Eph receptor B4 (EphB4) and its ligand ephrin-B2 via TNYL-RAW peptide
IC50
11100±n/a nM
Citation
 PubChem, PC Dose-response biochemical assay for antagonists of the interaction between the Eph receptor B4 (EphB4) and its ligand ephrin-B2 via TNYL-RAW peptide PubChem Bioassay (2007)[AID] 
Target
Name:
Ephrin type-B receptor 4
Synonyms:
EPHB4 Ephrin receptor HTK MYK1 Tyrosine-protein kinase TYRO11 | VHL/Ephrin type-B receptor 4
Type:
Enzyme
Mol. Mass.:
108273.51
Organism:
Homo sapiens (Human)
Description:
P54760
Residue:
987
  
Inhibitor
Name:
BDBM32068
Synonyms:
1-ethyl-2-[[4-(2-methylphenyl)-5-pyridin-3-yl-1,2,4-triazol-3-yl]sulfanylmethyl]benzimidazole-5-carboxylic acid;hydrochloride 1-ethyl-2-[[[4-(o-tolyl)-5-(3-pyridyl)-1,2,4-triazol-3-yl]thio]methyl]benzimidazole-5-carboxylic acid;hydrochloride SMR000067019 | cid_6602956
Type:
Small organic molecule
Emp. Form.:
C25H22N6O2S
Mol. Mass.:
470.546
SMILES:
CCn1c(CSc2nnc(-c3cccnc3)n2-c2ccccc2C)nc2cc(ccc12)C(O)=O
: